,Blood_Sample_1,Blood_Sample_2,Blood_Sample_3,Blood_Sample_4,Blood_Sample_5,Blood_Sample_6,Blood_Sample_7,Blood_Sample_8,Blood_Sample_9,Blood_Sample_10,Blood_Sample_11,Blood_Sample_12,Blood_Sample_13,Blood_Sample_14,Blood_Sample_15,Blood_Sample_16,Blood_Sample_17,Blood_Sample_18,Blood_Sample_19,Blood_Sample_20,Blood_Sample_21,Blood_Sample_22,Blood_Sample_23,Blood_Sample_24,Blood_Sample_25,Blood_Sample_26,Blood_Sample_27,Blood_Sample_28,Blood_Sample_29,Blood_Sample_30,Blood_Sample_31,Blood_Sample_32,Blood_Sample_33,Blood_Sample_34,Blood_Sample_35,Blood_Sample_36,Blood_Sample_37,Blood_Sample_38,Blood_Sample_39,Blood_Sample_40,Blood_Sample_41,Blood_Sample_42,Blood_Sample_43,Tumour_Sample_1,Tumour_Sample_2,Tumour_Sample_3,Tumour_Sample_4,Tumour_Sample_5,Tumour_Sample_6,Tumour_Sample_7,Tumour_Sample_8,Tumour_Sample_9,Tumour_Sample_10,Tumour_Sample_11,Tumour_Sample_12,Tumour_Sample_13,Tumour_Sample_14,Tumour_Sample_15,Tumour_Sample_16,Tumour_Sample_17,Tumour_Sample_18,Tumour_Sample_19,Tumour_Sample_20,Tumour_Sample_21,Tumour_Sample_22,Tumour_Sample_23,Tumour_Sample_24,Tumour_Sample_25,Tumour_Sample_26,Tumour_Sample_27,Tumour_Sample_28,Tumour_Sample_29,Tumour_Sample_30,Tumour_Sample_31,Tumour_Sample_32,Tumour_Sample_33,Tumour_Sample_34,Tumour_Sample_35,Tumour_Sample_36,Tumour_Sample_37,Tumour_Sample_38,Tumour_Sample_39,Tumour_Sample_40,Tumour_Sample_41,Tumour_Sample_42,Tumour_Sample_43,IlmnID,Infinium_Design_Type,CHR,MAPINFO,SourceSeq,Probe_SNPs,Probe_SNPs_10,UCSC_RefGene_Name,UCSC_RefGene_Accession,UCSC_RefGene_Group,UCSC_CpG_Islands_Name,Relation_to_UCSC_CpG_Island,Phantom,DMR,Enhancer,Regulatory_Feature_Name,Regulatory_Feature_Group,DHS,,,,,
cg25746226,0.142096625,0.163956758,0.130605999,0.117409277,0.164186778,0.129760226,0.176951368,0.083811531,0.130878785,0.087235366,0.098651621,0.105914342,0.090072661,0.103676731,0.104686238,0.127488758,0.097532036,0.097140806,0.094760905,0.075225624,0.095591008,0.101044837,0.1097961,0.100236944,0.119008701,0.073399484,0.107232947,0.107553278,0.126439165,0.090881002,0.130252791,0.107037622,0.133996646,0.084925139,0.078461235,0.092586685,0.065176906,0.07892016,0.117082351,0.098282494,0.08815894,0.09926728,0.105537124,0.08210882,0.068368068,0.056094007,0.082274011,0.052457687,0.07795193,0.059571739,0.081910932,0.070693717,0.084654579,0.071106061,0.078397206,0.065600903,0.064997404,0.087483882,0.077515268,0.121302807,0.080735072,0.079331939,0.07545143,0.069361913,0.09352643,0.085760704,0.109259019,0.06913074,0.070755576,0.081971531,0.059833209,0.071913489,0.095181733,0.085157585,0.082225457,0.065467483,0.058924947,0.076927552,0.077133617,0.127968034,0.062342608,0.10746536,0.106926043,0.105570072,0.076103237,0.077864199,cg25746226,I,2,47629792,CGACTGCCTCCCTTTTTCTTTCTAAGCAAACTGCCAACATCGGGATTACG,,,MSH2,NM_000251,TSS1500,chr2:47630067-47630791,N_Shore,,,NA,2:47629598-47631069,Promoter_Associated,NA,,,,,
cg17129141,0.043451344,0.054765041,0.041416244,0.026859479,0.072488189,0.050575199,0.055460208,0.045714565,0.035949465,0.028561739,0.020334742,0.04068704,0.025799688,0.036562056,0.044669558,0.023137297,0.034975359,0.034221151,0.031230241,0.031995976,0.028375085,0.026666784,0.046038351,0.032765823,0.037299497,0.033521705,0.039686225,0.041670079,0.029403598,0.035631351,0.038199424,0.031689629,0.045985143,0.028208132,0.02936508,0.045567164,0.032316502,0.028601754,0.022117011,0.031988318,0.029072748,0.041321768,0.037281435,0.06973113,0.06738971,0.068314943,0.061727852,0.054321379,0.079343975,0.059827946,0.069129407,0.114581051,0.053080484,0.06299429,0.041367223,0.028680832,0.05196661,0.065401758,0.02997098,0.108454582,0.058112784,0.053103054,0.073694501,0.077097142,0.029329731,0.093758954,0.088831673,0.050891585,0.023722506,0.050308733,0.065036203,0.0540942,0.051120604,0.050949951,0.075543829,0.093957679,0.069056194,0.061321118,0.091242207,0.130026044,0.037475938,0.08631834,0.058320934,0.113249596,0.080682842,0.056772182,cg17129141,II,2,47629949,CGAGCTCAGTGCCTGCCGGAAATCTCCCACCTGGTGGCAACCTACCCTTG,,,MSH2,NM_000251,TSS1500,chr2:47630067-47630791,N_Shore,,,NA,2:47629598-47631069,Promoter_Associated,NA,,,,,
cg22547404,0.056712488,0.062389022,0.045273076,0.050101484,0.066404002,0.063572726,0.077221558,0.048094605,0.045404135,0.046352357,0.037811621,0.033934374,0.051157109,0.060028289,0.045608347,0.046356685,0.054166974,0.044906723,0.040963091,0.043675277,0.047641019,0.04629846,0.053382108,0.049787893,0.054261588,0.039648787,0.073329362,0.047330561,0.041153284,0.06419478,0.049603672,0.055464441,0.076105322,0.052614669,0.041369373,0.061013011,0.037243043,0.054624492,0.051875885,0.03623512,0.056040179,0.043975326,0.060441435,0.100949396,0.067072638,0.063489073,0.062287705,0.062341526,0.052804743,0.072471585,0.084777266,0.088714059,0.058740634,0.074141173,0.039041733,0.042835373,0.06815501,0.104036811,0.051115579,0.073817491,0.066288162,0.077227018,0.077769099,0.07291264,0.073194619,0.080886259,0.049326757,0.071375267,0.05264708,0.058658907,0.064784954,0.085216958,0.07830568,0.066117029,0.096545941,0.088386797,0.060528409,0.097047338,0.101229786,0.14055886,0.074239043,0.053146843,0.078302053,0.142110675,0.093726483,0.08154586,cg22547404,I,2,47630147,CGGCCCAGCTTCCCGCGCACGCTGGTGACTTTAGCTACTGCGCATGCCTG,,,MSH2,NM_000251,TSS200,chr2:47630067-47630791,Island,,,NA,2:47629598-47631069,Promoter_Associated,NA,,,,,
cg25868465,0.069355385,0.081047858,0.085609522,0.089648402,0.059916731,0.074323955,0.073539383,0.08782108,0.080389467,0.073181455,0.077920731,0.095784117,0.078603135,0.083984837,0.070876925,0.078969542,0.092086692,0.109975502,0.078487077,0.079133229,0.069577459,0.092561073,0.075205103,0.057931824,0.093161775,0.07287714,0.071588377,0.067523848,0.081943018,0.087330871,0.078233731,0.07981751,0.080183523,0.077061824,0.067701659,0.082145364,0.066605646,0.084262293,0.062931904,0.076660001,0.070494291,0.068952792,0.08682911,0.05383452,0.153267821,0.079105694,0.079653856,0.043937742,0.058649684,0.059335464,0.048289062,0.04778536,0.05181408,0.042394416,0.056782337,0.050948296,0.063865249,0.069188743,0.068489544,0.029244947,0.062125108,0.055436922,0.050097348,0.070327209,0.073331179,0.085438216,0.06454442,0.065458002,0.071251444,0.046832856,0.056973467,0.063448058,0.067564534,0.108972153,0.048526804,0.088432938,0.088141517,0.055137917,0.056391018,0.098384084,0.077008101,0.046219992,0.073001774,0.091445848,0.052855467,0.048729635,cg25868465,II,2,47630172,CACACCCAATCAGCTTCCAGGGCTGCGTTTCGGTGGGTGGGAGTCTGCCG,rs2303425,,MSH2,NM_000251,TSS200,chr2:47630067-47630791,Island,,,NA,2:47629598-47631069,Promoter_Associated,NA,,,,,
cg22269526,0.095730535,0.084365432,0.103689489,0.119819763,0.110826654,0.125270231,0.115376571,0.088255761,0.11805681,0.091229156,0.08825661,0.109542948,0.094926651,0.10594362,0.089614287,0.091111296,0.127882401,0.161327623,0.090557296,0.085466716,0.082087729,0.104291309,0.094700926,0.076940112,0.137201685,0.101768747,0.0988019,0.110546202,0.07460504,0.118233487,0.102549787,0.070589936,0.160964531,0.070713203,0.102256552,0.165478095,0.088608615,0.084535461,0.09607873,0.118645783,0.107618126,0.071972202,0.144661972,0.100455377,0.050279112,0.100309997,0.082863523,0.114775801,0.093458043,0.056401461,0.109667592,0.134545944,0.063475622,0.092510602,0.137287362,0.081129861,0.055162437,0.12175121,0.040069484,0.147788559,0.159847745,0.138264331,0.056461984,0.076326107,0.252849355,0.090257231,0.069938536,0.062662623,0.074585318,0.105625849,0.094713128,0.107280859,0.077460333,0.058099303,0.060770515,0.123041781,0.077436556,0.090412643,0.08244863,0.177178135,0.076063417,0.07579133,0.116089229,0.139248852,0.111053903,0.12136385,cg22269526,II,2,47630224,AGACTCCCACCCACCGAAACGCAGCCCTGGAAGCTGATTGGGTGTGGTCG,rs2303425,,MSH2,NM_000251,TSS200,chr2:47630067-47630791,Island,high-CpG:47483694-47483832,,NA,2:47629598-47631069,Promoter_Associated,NA,,,,,
cg06478094,0.063667282,0.044688315,0.054262504,0.039996881,0.083026967,0.112149731,0.064857064,0.046551865,0.053127881,0.061431342,0.047298151,0.067020561,0.056990292,0.063168397,0.041923586,0.028470575,0.045280591,0.053538389,0.043769204,0.030898139,0.049994356,0.064126462,0.047195273,0.057376907,0.049281376,0.035899616,0.049850564,0.03165816,0.040916645,0.049433986,0.050132822,0.053164203,0.074424066,0.033381738,0.042316788,0.046890012,0.050501063,0.032940392,0.040171236,0.053881368,0.061449627,0.05562718,0.062391097,0.094241022,0.089653676,0.0989205,0.126693099,0.094787724,0.073415671,0.08353651,0.126503566,0.17945649,0.087595916,0.0907986,0.069036218,0.055323754,0.115900714,0.118468087,0.035728902,0.1650985,0.123893077,0.109407696,0.112916564,0.121120707,0.152857555,0.160847602,0.086366777,0.118004086,0.095952814,0.191522759,0.118061145,0.1200244,0.11908179,0.083264738,0.102878444,0.120336052,0.098496509,0.123247526,0.109531716,0.211011167,0.08475062,0.208468211,0.087589065,0.182244918,0.122840042,0.140851617,cg06478094,I,2,47630251,CGTCCCCCGAGCGGCGTCCGGCCACGGCGACCACACCCAATCAGCTTCCA,,,MSH2,NM_000251,TSS200,chr2:47630067-47630791,Island,high-CpG:47483694-47483832,,NA,2:47629598-47631069,Promoter_Associated,NA,,,,,
cg00547758,0.027830115,0.031516055,0.032723771,0.034902513,0.029147088,0.035805275,0.035080162,0.027032863,0.037984276,0.028993804,0.040635598,0.036645659,0.034083634,0.039295059,0.043123014,0.050304071,0.039535841,0.042344994,0.039194737,0.043369717,0.026986315,0.037063155,0.043489255,0.04007993,0.039154604,0.049612798,0.042940368,0.032665057,0.029395975,0.043005631,0.046715275,0.034304362,0.039739931,0.032078889,0.036434362,0.042341448,0.033637186,0.046261133,0.041829706,0.042982719,0.027682949,0.040945987,0.039657965,0.03715467,0.035382364,0.025049561,0.04360673,0.052848666,0.017198674,0.035886982,0.041453598,0.040825438,0.035332878,0.041985642,0.037602059,0.030606593,0.031588026,0.036136628,0.028803074,0.04844328,0.032143071,0.028604263,0.056585246,0.04257643,0.031913906,0.04635493,0.065987784,0.03582302,0.044705144,0.032268015,0.036602412,0.044079825,0.035245308,0.040496885,0.040723779,0.049692727,0.048287513,0.027867531,0.043335883,0.062837828,0.04029388,0.023647567,0.034276423,0.044544438,0.076828112,0.0433239,cg00547758,I,2,47630294,GCTGCACCGCCATGTCGAAACCTCCTCACCTCCTGGTTGAAGAAAATGCG,rs68154274,,MSH2;MSH2,NM_000251;NM_000251,5'UTR;1stExon,chr2:47630067-47630791,Island,high-CpG:47483694-47483832,,NA,2:47629598-47631069,Promoter_Associated,NA,,,,,
cg14282180,0.065791146,0.048711564,0.056404035,0.057426596,0.084416567,0.067072147,0.05819021,0.054284319,0.060223062,0.04446301,0.044032451,0.05971739,0.049871231,0.066512526,0.050531037,0.060543975,0.054326795,0.050259204,0.056782312,0.060657143,0.052013669,0.045986546,0.058618166,0.052952479,0.095061181,0.07174841,0.060663364,0.068330091,0.051876037,0.068711275,0.056770949,0.054647209,0.063813375,0.054080376,0.05158775,0.058220135,0.047228907,0.048848444,0.043975146,0.071961373,0.049545964,0.046838168,0.046465522,0.071083267,0.058340865,0.059625766,0.061536485,0.063038593,0.048046458,0.047249012,0.062288724,0.06122495,0.058251347,0.088680262,0.066356169,0.050426288,0.064557749,0.09225684,0.046270241,0.068617202,0.061453599,0.045425128,0.062642029,0.068207673,0.064366466,0.08371237,0.049842535,0.054433349,0.064423287,0.058009308,0.059774648,0.077008658,0.051614672,0.050890242,0.069655415,0.066345905,0.065534157,0.063714195,0.082126101,0.10545653,0.05779668,0.063020721,0.061719503,0.110018626,0.06635648,0.061501589,cg14282180,I,2,47630433,TTCGTGCGCTTCTTTCAGGGCATGCCGGAGAAGCCGACCACCACAGTGCG,,rs63750728,MSH2,NM_000251,1stExon,chr2:47630067-47630791,Island,,,NA,2:47629598-47631069,Promoter_Associated,NA,,,,,
cg03639557,0.078425286,0.04694426,0.043015741,0.055708109,0.075179467,0.089468261,0.087183819,0.052569909,0.042105836,0.046130475,0.06020261,0.04865907,0.048436186,0.050579891,0.042305793,0.041208598,0.048291449,0.039253436,0.037539454,0.050061703,0.046720167,0.048967216,0.051124182,0.047471091,0.08440702,0.043693535,0.044748826,0.058844343,0.044920802,0.044488415,0.04663275,0.060957422,0.056150752,0.057420569,0.045111055,0.065966279,0.041182331,0.041461477,0.040576969,0.067337242,0.054342352,0.045228285,0.065668642,0.07848135,0.063380835,0.075765632,0.069268569,0.046827586,0.078550416,0.058942332,0.080948624,0.082730454,0.063564746,0.069926576,0.087976714,0.065544727,0.049250222,0.077060253,0.043034324,0.119721465,0.063604423,0.05041364,0.069430847,0.067452198,0.07070348,0.091696414,0.118739598,0.080541362,0.057030691,0.057409022,0.073324212,0.083656711,0.04663426,0.056171819,0.053577112,0.081516589,0.060653326,0.097560812,0.064027682,0.111299813,0.042206731,0.06214577,0.053573714,0.15277192,0.064590368,0.091032579,cg03639557,II,2,47630787,CGTCGTGCCAGGCATTTTAATGCATTGTTCTAGTTCATTTTCCAGCAGTC,,,MSH2,NM_000251,Body,chr2:47630067-47630791,Island,,,NA,2:47629598-47631069,Promoter_Associated,NA,,,,,
cg11311499,0.048130708,0.090200326,0.055035756,0.043713351,0.081933382,0.093823913,0.131675819,0.054707848,0.058414576,0.04420471,0.055958934,0.067495757,0.056945503,0.058111878,0.05483749,0.073499584,0.056937941,0.054624019,0.053131898,0.06017623,0.05718732,0.052020038,0.054617207,0.049503826,0.051455361,0.049098268,0.053047948,0.068059834,0.053942494,0.069369672,0.051427226,0.05196086,0.049834282,0.054556086,0.038272217,0.054747548,0.05940103,0.053235605,0.049252542,0.062626127,0.068994588,0.054047846,0.081376279,0.060710657,0.054096032,0.05121464,0.056515613,0.061094387,0.057746468,0.052961859,0.063342272,0.091214692,0.046519825,0.065690822,0.094838545,0.047094692,0.052644867,0.100444015,0.063458487,0.074648844,0.071086998,0.055302579,0.072928666,0.06803711,0.067402723,0.061200511,0.0571292,0.067874769,0.063590243,0.062580982,0.053140275,0.060428835,0.085267476,0.05987405,0.050332068,0.068968189,0.065215361,0.062816483,0.057727084,0.106627625,0.074041879,0.093654292,0.100177775,0.079549005,0.060099708,0.108272288,cg11311499,II,2,47630845,GGCATTTTAATGCATTGTTCTAGTTCATTTTCCAGCAGTCGCATTCCTCG,,,MSH2,NM_000251,Body,chr2:47630067-47630791,S_Shore,,,NA,2:47629598-47631069,Promoter_Associated,NA,,,,,
cg02458113,0.05444402,0.026701239,0.062736001,0.037755022,0.048099966,0.051968839,0.052785537,0.04181927,0.032468898,0.044412077,0.042691494,0.037288183,0.04111306,0.033512218,0.050974054,0.041415898,0.054618245,0.05039102,0.040877393,0.038858269,0.037365301,0.024113891,0.04074962,0.041961164,0.037628675,0.021053656,0.05307245,0.058500954,0.038539497,0.051754947,0.080927664,0.036965952,0.054466189,0.051693828,0.034572951,0.048367986,0.054231778,0.031789157,0.040140375,0.043917215,0.037072005,0.044139915,0.058152329,0.083806277,0.038605343,0.075300454,0.208356491,0.026654694,0.036426442,0.05336263,0.025066674,0.056467584,0.081439413,0.087667222,0.048545259,0.064669917,0.03989422,0.013271604,0.021679642,0.029990353,0.036900363,0.031547733,0.040502442,0.096383227,0.095752588,0.04005654,0.031402755,0.035220293,0.021522795,0.047005047,0.03148093,0.044327258,0.083474088,0.021394426,0.024821126,0.031983893,0.034269978,0.227944146,0.101759303,0.08241234,0.033657123,0.039409385,0.035215573,0.092031615,0.074212149,0.038110729,cg02458113,II,2,47631120,CTGGAGCTGGGCTGCTTGGGATCAAGTCGCTGCCCCTCTGCTTATTAACG,,,MSH2,NM_000251,Body,chr2:47630067-47630791,S_Shore,,,NA,2:47631113-47631197,Promoter_Associated,NA,,,,,
cg09740554,0.16191595,0.077207085,0.145824085,0.216113619,0.115249377,0.160709667,0.117615439,0.098232399,0.108897488,0.082018827,0.171259915,0.107870021,0.102930372,0.159994099,0.111980777,0.11034982,0.118980217,0.114702621,0.16325022,0.110243358,0.115186922,0.13148989,0.129472048,0.131718351,0.100212725,0.126641776,0.101813122,0.128431209,0.093543732,0.106540917,0.103840296,0.137126286,0.159112488,0.130242481,0.09733059,0.110703322,0.090206688,0.13312159,0.088538001,0.108689701,0.102130421,0.378175911,0.119399293,0.093262496,0.090915006,0.195357398,0.200873187,0.056704356,0.050597213,0.063597372,0.105300214,0.055530145,0.045517701,0.065080246,0.064609899,0.066453275,0.067122358,0.088964228,0.06740553,0.382959292,0.110726927,0.068570672,0.113996289,0.187595181,0.062538967,0.066706752,0.050972467,0.085659793,0.06870087,0.047192958,0.077682303,0.119188167,0.068951469,0.120459419,0.068090749,0.072883929,0.084578064,0.211409205,0.130171998,0.096828598,0.059841098,0.047652664,0.089663375,0.154805378,0.072699738,0.084457195,cg09740554,II,2,47631145,GTCGCTGCCCCTCTGCTTATTAACGTGTGACCTTGGGCCAGTCATGGACG,,,MSH2,NM_000251,Body,chr2:47630067-47630791,S_Shore,,,NA,2:47631113-47631197,Promoter_Associated,NA,,,,,
cg23898128,0.904434022,0.854983026,0.875757071,0.954236778,0.91641905,0.887804344,0.90892654,0.924447975,0.885251976,0.921521876,0.937746074,0.970347332,0.945728814,0.939466488,0.915859116,0.928544225,0.94215584,0.956149577,0.940030868,0.940316057,0.943041164,0.964936077,0.960438605,0.933801635,0.924787685,0.939660721,0.921967384,0.951692006,0.93706608,0.922865334,0.935955155,0.933818451,0.952706963,0.944572108,0.951826902,0.930165824,0.939743482,0.928521418,0.952488626,0.911557944,0.956766829,0.934378264,0.893810103,0.784587926,0.923571347,0.857952335,0.863214436,0.84743047,0.861589702,0.903491489,0.879566912,0.661388113,0.869377366,0.795799134,0.849606367,0.922067898,0.927676749,0.946158705,0.917026712,0.884417152,0.889646422,0.902329536,0.913470345,0.806253276,0.856477067,0.813685497,0.872848112,0.936277984,0.917830162,0.905610559,0.875434403,0.902219211,0.857070465,0.910881803,0.88574821,0.831164925,0.823463503,0.821222785,0.756331088,0.760348139,0.88732637,0.882456042,0.824221665,0.726254211,0.822269516,0.894258065,cg23898128,II,2,47633216,GTGAGGCCTCCTCAGCCATGTGGAACTGGCTGCAGAGTCATTAAACTTCG,,,MSH2,NM_000251,Body,chr2:47630067-47630791,S_Shelf,,,NA,,,NA,,,,,
cg19180827,0.552456459,0.615745803,0.516636065,0.727282642,0.598410063,0.558572036,0.542572532,0.668653777,0.666798155,0.616618125,0.678842589,0.611826035,0.728557155,0.657214554,0.663512509,0.602122717,0.701050614,0.661291086,0.671192672,0.719050751,0.580723147,0.647158032,0.622018448,0.605438466,0.636950652,0.607728713,0.670316476,0.643624807,0.670725543,0.613688313,0.627908491,0.710770358,0.571836856,0.649088805,0.663780472,0.633263152,0.716481159,0.650641044,0.623446518,0.602480714,0.657255794,0.530902235,0.613978497,0.755558091,0.766368907,0.699528733,0.761471647,0.710153989,0.777844322,0.704652493,0.763727574,0.700509021,0.712125226,0.784113178,0.749431586,0.813467742,0.710650435,0.759702883,0.743567006,0.701760214,0.789252124,0.790349289,0.741209407,0.723672335,0.760972842,0.688652557,0.756545218,0.75077944,0.72971271,0.670723747,0.749426152,0.801352296,0.815981428,0.756112808,0.746066622,0.795532286,0.683926508,0.700526438,0.676858205,0.640531495,0.777349122,0.672783268,0.714470224,0.646551991,0.66903882,0.747739042,cg19180827,II,2,47684718,CGTGAGGGCGGTTTCCCCTGGGTGCTGTTCTCATTATAGTGACTGACTTG,,,MSH2,NM_000251,Body,,,,,NA,,,NA,,,,,
cg05039065,0.091699926,0.127574747,0.09525893,0.093107776,0.157794171,0.161166043,0.137161353,0.070602497,0.088377891,0.067853063,0.073695759,0.05567678,0.088947579,0.084171594,0.071005542,0.069076003,0.089107733,0.072026929,0.047040875,0.089636285,0.094573885,0.066783283,0.072443347,0.09737298,0.08938053,0.071303312,0.074898514,0.104505109,0.071211535,0.087318596,0.107443306,0.077226781,0.101743314,0.058661197,0.06890846,0.104879829,0.071106874,0.079078582,0.080168509,0.094977716,0.07838813,0.083208296,0.091231329,0.074481458,0.077483479,0.080169178,0.14677311,0.074358146,0.076722826,0.084600199,0.104187762,0.171208017,0.074102012,0.058881168,0.076431938,0.098051416,0.064946605,0.084241852,0.075663281,0.13154618,0.08439229,0.109701117,0.076227098,0.075915742,0.124197286,0.09894045,0.079302793,0.054122992,0.079194859,0.073314356,0.062494327,0.080590615,0.080711942,0.091092256,0.090184571,0.079355257,0.076707477,0.108521508,0.072144291,0.257372068,0.080417293,0.170118279,0.087942442,0.145707475,0.094810409,0.112327097,cg05039065,II,2,48009698,AAAGGAAAACTTTGTACAGCTGCAGGCTTTCACCATACACAACAGCATCG,,,MSH6,NM_000179,TSS1500,chr2:48009808-48011443,N_Shore,,,NA,,,NA,,,,,
cg02905881,0.043280829,0.062339285,0.062096183,0.037790403,0.075903811,0.07514969,0.056886378,0.041433934,0.056387958,0.025956243,0.03650082,0.028787801,0.040402411,0.045530568,0.043584826,0.041474887,0.052971391,0.031979535,0.050951207,0.023681534,0.047706433,0.045016173,0.049240719,0.025317565,0.054745874,0.025013981,0.047670607,0.053094906,0.041834531,0.029737881,0.058962313,0.029742649,0.028724514,0.040861505,0.035533314,0.044714694,0.036217594,0.030694971,0.037238823,0.05428457,0.047989256,0.099643619,0.059289489,0.097655103,0.041125969,0.080194652,0.070900772,0.049530101,0.086759156,0.069527505,0.045037717,0.136629747,0.046256953,0.028640922,0.063181359,0.065844742,0.034097925,0.031591661,0.035763179,0.07998375,0.038384543,0.055472245,0.031976738,0.127983542,0.076451638,0.066193912,0.048167041,0.049323229,0.012970305,0.056746361,0.032475579,0.08255162,0.046456764,0.067171456,0.037988319,0.063663217,0.059982798,0.068666111,0.048969843,0.105514248,0.044252781,0.039696171,0.042446613,0.097821178,0.036079959,0.051154578,cg02905881,II,2,48009730,CGCTAAATGAATATTGTAATAGCATTCGTTAGCGATGCTGTTGTGTATGG,,,MSH6,NM_000179,TSS1500,chr2:48009808-48011443,N_Shore,,,NA,,,NA,,,,,
cg11869233,0.064273787,0.064839232,0.082142682,0.040623009,0.107972345,0.070847108,0.08566614,0.04515416,0.052358091,0.049856269,0.039906056,0.050553096,0.037567728,0.042200982,0.037560661,0.0314397,0.041604868,0.040168388,0.047052483,0.036477168,0.054559381,0.047228858,0.03363526,0.033464149,0.064124778,0.043938721,0.066965185,0.057187613,0.037771222,0.037408283,0.042101741,0.030882686,0.056240013,0.044833791,0.037562822,0.059153872,0.046700842,0.042355464,0.04513216,0.035082016,0.033725405,0.039521493,0.060429212,0.04546124,0.045508108,0.030871833,0.087629102,0.050736256,0.070401691,0.027276126,0.047291586,0.108320753,0.030778679,0.041052408,0.040769614,0.020921266,0.033072118,0.021452773,0.018940447,0.059005929,0.034893084,0.047108603,0.047229651,0.032290819,0.031847703,0.047106793,0.049865929,0.027006735,0.03176709,0.07736823,0.027254171,0.027279923,0.036547091,0.064373609,0.034077941,0.061485689,0.04028897,0.055230304,0.023524659,0.087902859,0.051560762,0.028056572,0.033871727,0.102606133,0.034938092,0.043557006,cg11869233,II,2,48009809,TGAGAATACAACGTGAAGGTGAACTGCTGACTAAAGTTTGGTCCCTTTCG,,,MSH6,NM_000179,TSS1500,chr2:48009808-48011443,Island,,,NA,,,NA,,,,,
cg09898070,0.264942447,0.265529916,0.253020626,0.289140916,0.306213354,0.280326039,0.31214474,0.235150553,0.278360012,0.283066283,0.268016149,0.252816658,0.292212573,0.278053638,0.266735633,0.264565051,0.282814223,0.277074126,0.284922039,0.273705499,0.269783403,0.319156403,0.291303295,0.256615324,0.239328039,0.279969523,0.291392355,0.284474493,0.295004809,0.295846366,0.283910371,0.281442674,0.262304498,0.270189854,0.249873734,0.282086407,0.28455997,0.237431956,0.28493039,0.252976455,0.271459005,0.28253256,0.27206637,0.177973297,0.141704791,0.176715489,0.25178465,0.167257986,0.138726194,0.168577233,0.199249488,0.27356905,0.217083233,0.157222641,0.174431677,0.143860539,0.203866695,0.198354388,0.195767556,0.16079282,0.149009461,0.21138444,0.188701404,0.2144469,0.20112463,0.245121342,0.184422143,0.182300583,0.209894691,0.209394588,0.207743416,0.21567346,0.191906374,0.176800499,0.20296412,0.200479049,0.190786522,0.223101567,0.226701026,0.210353894,0.157496241,0.160824174,0.221891534,0.305934837,0.193368472,0.204281306,cg09898070,I,2,48009866,TAACCGGGGGGACCCGAAAGGCCTCGGAAAGGGGCTCGCGGGGAGAAACG,,,MSH6,NM_000179,TSS1500,chr2:48009808-48011443,Island,,,NA,2:48009836-48010007,Promoter_Associated,NA,,,,,